{"text_format":"1","workbook":"xlsx","n_sheets":4,"sheets":["Instructions","Personal Budget","Actual Performance","chart_calcs"],"not_rendered":{"charts":8,"images":1,"macros":1,"external_links":0,"defined_names":55,"comments":0,"pivot_tables":0},"unopened":[],"bounds":{"document_bytes":16777216,"sheet_cells":100000,"rows_first":2000,"rows_last":500,"rows_between":2000,"halvings":0,"cell_chars":16384,"cell_head_chars":4096},"cells_cut":0,"cells_raw":0,"read":"whole","date_system":"1900"}

{"sheet":"Instructions","index":0,"n_rows":52,"n_cols":2,"rows_kept":52,"cut":false,"hidden":false,"merged":[]}
[]
[null,"Instructions for completing your Personal Budget"]
[]
[null,"Note: It’s not possible to add or delete rows.  All expense category headings and line items can be edited. Each category has an 'Other' row at the bottom. There's also an 'Other/Misc' section available for expenses which don't fit into the existing categories. Ensure you update the category heading and each line item. For any income or expense items not relevant, simply leave the row blank."]
[]
[null,"Personal Budget Sheet"]
[null,"1.       Select the year ending date from the dropdown cells.  The Personal Budget sheet automatically opens at this field.  The month selected will automatically update the template to start with the month at the beginning of the year."]
[null,"2.       Enter your name in cell C2."]
[null,"3.       Click ‘Begin Budget’.  This will take you to the first input cell.  The Monthly Cash Summary section automatically calculates based on the income and expenses inputted into the template; you can’t edit these cells."]
[null,"4.       Begin by entering your income for the year, after tax.  Select the frequency from the dropdown box for each type of income and enter the amount:"]
[null,"·         Monthly: This is the default frequency.  Enter the monthly figure in the Amount column and it will populate the same figure across the months."]
[null,"·         Manual: If the amount changes each month or payments are irregular (e.g. one-off, quarterly, bi-annually, etc.), select Manual from the dropdown then enter the amount in the relevant month/s."]
[null,"·         Weekly: If the amount is received weekly, select Weekly from the dropdown then enter the weekly figure in the Amount column.  This amount will be multiplied by 52 and divided by 12 to calculate the monthly figure and will automatically populate across each month."]
[null,"·         Fortnightly: If the amount is received fortnightly, select Fortnightly from the dropdown then enter the fortnightly figure in the Amount column.  This amount will be multiplied by 26 and divided by 12 to calculate the monthly figure and will automatically populate across each month.  "]
[null,"·         Annually: If you’re billed annually for any expenses but for budgeting purposes pay more frequently, e.g. by monthly automatic payment, select Annually from the dropdown then enter the annual figure in the Amount column.  The amount will be divided by 12 to calculate the monthly figure and will automatically populate across each month."]
[null,"5.       Monthly and annual income totals calculate automatically; you can’t enter data into any of these calculating cells."]
[null,"6.       Follow the same process of selecting the frequency and entering the amount for each expense within the 10 categories:"]
[null,"·         Household"]
[null,"-          Record the interest portion of your mortgage in this section; the principal repayments will go in the Debt Repayments category.  If you’re unsure of the split between interest and principal, there are many Monthly Loan Amortisation calculators available on the internet"]
[null,"·         Food"]
{"$rows_left_out":33}
{"sheet":"Personal Budget","index":1,"n_rows":150,"n_cols":19,"rows_kept":150,"cut":false,"hidden":false,"merged":[[40,3,40,4],[5,15,5,19],[5,1,5,2],[5,7,5,11],[0,14,0,15],[0,1,0,11],[0,16,0,18],[0,12,0,13]]}
[null,"Personal Budget for the year ending:",null,null,null,null,null,null,null,null,null,null,30,null,"Jun",null,2023]
[null,"Name:"]
[]
[]
[null,{"$f":"chart_calcs!$D$6","v":"Annual Income:"},null,null,null,null,null,{"$f":"chart_calcs!$D$7","v":"Annual Expenses:"},null,null,null,null,null,null,null,{"$f":"chart_calcs!$D$8","v":"Annual Cash Surplus (Deficit):"}]
[null,{"$f":"chart_calcs!$F$6","v":0},null,null,null,null,null,{"$f":"chart_calcs!$F$7","v":0},null,null,null,null,null,null,null,{"$f":"chart_calcs!$F$8","v":0}]
[]
[]
[]
[]
[]
[]
[]
[]
[]
[]
[]
[]
[]
[]
{"$rows_left_out":131}
{"sheet":"Actual Performance","index":2,"n_rows":161,"n_cols":32,"rows_kept":161,"cut":false,"hidden":false,"merged":[[40,3,40,4],[5,1,5,2],[30,5,30,6],[30,7,30,8],[30,9,30,10],[26,23,26,24],[26,25,26,26],[26,27,26,28],[26,5,26,6],[26,7,26,8],[26,9,26,10],[26,15,26,16],[26,11,26,12],[26,13,26,14],[26,17,26,18],[26,19,26,20],[26,21,26,22],[30,21,30,22],[30,23,30,24],[30,25,30,26],[30,27,30,28],[41,5,41,6],[41,7,41,8],[41,9,41,10],[41,11,41,12],[41,13,41,14],[41,15,41,16],[41,17,41,18],[41,19,41,20],[41,21,41,22],[41,23,41,24],[41,25,41,26],[41,27,41,28],[30,11,30,12],[30,13,30,14],[30,15,30,16],[30,17,30,18],[30,19,30,20],[59,25,59,26],[59,27,59,28],[59,15,59,16],[59,17,59,18],[59,19,59,20],[59,21,59,22],[59,23,59,24],[59,5,59,6],[59,7,59,8],[59,9,59,10],[59,11,59,12],[59,13,59,14],[68,23,68,24],[68,25,68,26],[68,27,68,28],[78,19,78,20],[78,21,78,22],[78,23,78,24],[78,15,78,16],[78,17,78,18],[78,9,78,10],[78,11,78,12],[78,13,78,14],[68,5,68,6],[68,7,68,8],[68,9,68,10],[68,11,68,12],[68,13,68,14],[68,15,68,16],[68,17,68,18],[68,19,68,20],[68,21,68,22],[78,25,78,26],[78,27,78,28],[89,5,89,6],[89,7,89,8],[89,9,89,10],[89,11,89,12],[89,13,89,14],[89,15,89,16],[89,17,89,18],[89,19,89,20],[89,21,89,22],[89,23,89,24],[89,25,89,26],[89,27,89,28],[78,5,78,6],[78,7,78,8],[99,25,99,26],[99,27,99,28],[111,5,111,6],[111,7,111,8],[111,9,111,10],[111,11,111,12],[111,13,111,14],[111,15,111,16],[111,17,111,18],[111,19,111,20],[111,21,111,22],[111,23,111,24],[111,25,111,26],[111,27,111,28],[99,15,99,16],[99,17,99,18],[99,19,99,20],[99,21,99,22],[99,23,99,24],[99,5,99,6],[99,7,99,8],[99,9,99,10],[99,11,99,12],[99,13,99,14],[121,25,121,26],[121,27,121,28],[135,5,135,6],[135,7,135,8],[135,9,135,10],[135,11,135,12],[135,13,135,14],[135,15,135,16],[135,17,135,18],[135,19,135,20],[135,21,135,22],[135,23,135,24],[135,25,135,26],[135,27,135,28],[121,15,121,16],[121,17,121,18],[121,19,121,20],[121,21,121,22],[121,23,121,24],[121,5,121,6],[121,7,121,8],[121,9,121,10],[121,11,121,12],[121,13,121,14],[146,23,146,24],[146,25,146,26],[146,27,146,28],[146,5,146,6],[146,7,146,8],[146,9,146,10],[146,11,146,12],[146,13,146,14],[146,15,146,16],[146,17,146,18],[146,19,146,20],[146,21,146,22]]}
[null,"Personal Budget for the year ending:",null,null,null,null,null,null,null,null,null,null,null,null,{"$f":"DateAsANumber & \" \" & T('Personal Budget'!O1:P1) & \" \" & Year","v":"30 Jun 2023"}]
[null,"Name:",{"$f":"T('Personal Budget'!C2)","v":""}]
[]
[]
[null,{"$f":"chart_calcs!$D$6","v":"Annual Income:"},null,null,null,null,null,null,null,null,{"$f":"chart_calcs!$D$7","v":"Annual Expenses:"},null,null,null,null,null,null,null,null,null,null,null,null,null,null,null,{"$f":"chart_calcs!$D$8","v":"Annual Cash Surplus (Deficit):"}]
[null,{"$f":"chart_calcs!$F$6","v":0},null,null,null,null,null,null,null,null,{"$f":"chart_calcs!$F$7","v":0},null,null,null,null,null,null,null,null,null,null,null,null,null,null,null,{"$f":"chart_calcs!$F$8","v":0}]
[]
[]
[]
[]
[]
[]
[]
[]
[]
[]
[]
[]
[]
[]
{"$rows_left_out":142}
{"sheet":"chart_calcs","index":3,"n_rows":31,"n_cols":16,"rows_kept":31,"cut":false,"hidden":true,"merged":[]}
["***This sheet should remain HIDDEN***"]
[]
[null,null,null,{"$f":"IFERROR(PROPER(TEXT(VALUE(SelectedPeriod&\" 1\"),\"mmmm\")),\"Annual\")","v":"Annual"}]
[]
[null,null,null,"Dynamic Chart Titles"]
[null,null,null,{"$f":"D3&\" Income:\"","v":"Annual Income:"},null,{"$f":"INDEX('Personal Budget'!$F$39:$R$39,,SelectedPeriodColumn)","v":0}]
[null,null,null,{"$f":"D3&\" Expenses:\"","v":"Annual Expenses:"},null,{"$f":"INDEX('Personal Budget'!$F$150:$R$150,,SelectedPeriodColumn)","v":0}]
[null,null,null,{"$f":"D3&\" Cash Surplus (Deficit):\"","v":"Annual Cash Surplus (Deficit):"},{"$f":"INDEX('Personal Budget'!F29:R29,ScrollBarValue)","v":0},{"$f":"E8","v":0}]
[]
[]
[]
[null,null,null,{"$f":"PROPER('Personal Budget'!F28)","v":"Jul "},{"$f":"PROPER('Personal Budget'!G28)","v":"Aug "},{"$f":"PROPER('Personal Budget'!H28)","v":"Sep "},{"$f":"PROPER('Personal Budget'!I28)","v":"Oct "},{"$f":"PROPER('Personal Budget'!J28)","v":"Nov "},{"$f":"PROPER('Personal Budget'!K28)","v":"Dec "},{"$f":"PROPER('Personal Budget'!L28)","v":"Jan "},{"$f":"PROPER('Personal Budget'!M28)","v":"Feb "},{"$f":"PROPER('Personal Budget'!N28)","v":"Mar "},{"$f":"PROPER('Personal Budget'!O28)","v":"Apr "},{"$f":"PROPER('Personal Budget'!P28)","v":"May "},{"$f":"PROPER('Personal Budget'!Q28)","v":"Jun "},{"$f":"PROPER('Personal Budget'!R28)","v":"Annual"}]
[null,null,"Scroll Bar Value: ",13]
[null,null,"Cash Flow Chart: ",{"$f":"IF(SelectedPeriod='Personal Budget'!F$32,IF('Personal Budget'!$F$29:$R$29>=0,'Personal Budget'!$F$29:$R$29,NA()),NA())","v":{"$error":"#N/A"}},{"$f":"IF(SelectedPeriod='Personal Budget'!G$32,IF('Personal Budget'!$F$29:$R$29>=0,'Personal Budget'!$F$29:$R$29,NA()),NA())","v":{"$error":"#N/A"}},{"$f":"IF(SelectedPeriod='Personal Budget'!H$32,IF('Personal Budget'!$F$29:$R$29>=0,'Personal Budget'!$F$29:$R$29,NA()),NA())","v":{"$error":"#N/A"}},{"$f":"IF(SelectedPeriod='Personal Budget'!I$32,IF('Personal Budget'!$F$29:$R$29>=0,'Personal Budget'!$F$29:$R$29,NA()),NA())","v":{"$error":"#N/A"}},{"$f":"IF(SelectedPeriod='Personal Budget'!J$32,IF('Personal Budget'!$F$29:$R$29>=0,'Personal Budget'!$F$29:$R$29,NA()),NA())","v":{"$error":"#N/A"}},{"$f":"IF(SelectedPeriod='Personal Budget'!K$32,IF('Personal Budget'!$F$29:$R$29>=0,'Personal Budget'!$F$29:$R$29,NA()),NA())","v":{"$error":"#N/A"}},{"$f":"IF(SelectedPeriod='Personal Budget'!L$32,IF('Personal Budget'!$F$29:$R$29>=0,'Personal Budget'!$F$29:$R$29,NA()),NA())","v":{"$error":"#N/A"}},{"$f":"IF(SelectedPeriod='Personal Budget'!M$32,IF('Personal Budget'!$F$29:$R$29>=0,'Personal Budget'!$F$29:$R$29,NA()),NA())","v":{"$error":"#N/A"}},{"$f":"IF(SelectedPeriod='Personal Budget'!N$32,IF('Personal Budget'!$F$29:$R$29>=0,'Personal Budget'!$F$29:$R$29,NA()),NA())","v":{"$error":"#N/A"}},{"$f":"IF(SelectedPeriod='Personal Budget'!O$32,IF('Personal Budget'!$F$29:$R$29>=0,'Personal Budget'!$F$29:$R$29,NA()),NA())","v":{"$error":"#N/A"}},{"$f":"IF(SelectedPeriod='Personal Budget'!P$32,IF('Personal Budget'!$F$29:$R$29>=0,'Personal Budget'!$F$29:$R$29,NA()),NA())","v":{"$error":"#N/A"}},{"$f":"IF(SelectedPeriod='Personal Budget'!Q$32,IF('Personal Budget'!$F$29:$R$29>=0,'Personal Budget'!$F$29:$R$29,NA()),NA())","v":{"$error":"#N/A"}},{"$f":"IF(SelectedPeriod='Personal Budget'!R$32,IF('Personal Budget'!$F$29:$R$29>=0,'Personal Budget'!$F$29:$R$29,NA()),NA())","v":0}]
[null,null,"Cumulative: ",{"$f":"IF(SelectedPeriod='Personal Budget'!F$32,IF('Personal Budget'!$F$29:$R$29<0,'Personal Budget'!$F$29:$R$29,NA()),NA())","v":{"$error":"#N/A"}},{"$f":"IF(SelectedPeriod='Personal Budget'!G$32,IF('Personal Budget'!$F$29:$R$29<0,'Personal Budget'!$F$29:$R$29,NA()),NA())","v":{"$error":"#N/A"}},{"$f":"IF(SelectedPeriod='Personal Budget'!H$32,IF('Personal Budget'!$F$29:$R$29<0,'Personal Budget'!$F$29:$R$29,NA()),NA())","v":{"$error":"#N/A"}},{"$f":"IF(SelectedPeriod='Personal Budget'!I$32,IF('Personal Budget'!$F$29:$R$29<0,'Personal Budget'!$F$29:$R$29,NA()),NA())","v":{"$error":"#N/A"}},{"$f":"IF(SelectedPeriod='Personal Budget'!J$32,IF('Personal Budget'!$F$29:$R$29<0,'Personal Budget'!$F$29:$R$29,NA()),NA())","v":{"$error":"#N/A"}},{"$f":"IF(SelectedPeriod='Personal Budget'!K$32,IF('Personal Budget'!$F$29:$R$29<0,'Personal Budget'!$F$29:$R$29,NA()),NA())","v":{"$error":"#N/A"}},{"$f":"IF(SelectedPeriod='Personal Budget'!L$32,IF('Personal Budget'!$F$29:$R$29<0,'Personal Budget'!$F$29:$R$29,NA()),NA())","v":{"$error":"#N/A"}},{"$f":"IF(SelectedPeriod='Personal Budget'!M$32,IF('Personal Budget'!$F$29:$R$29<0,'Personal Budget'!$F$29:$R$29,NA()),NA())","v":{"$error":"#N/A"}},{"$f":"IF(SelectedPeriod='Personal Budget'!N$32,IF('Personal Budget'!$F$29:$R$29<0,'Personal Budget'!$F$29:$R$29,NA()),NA())","v":{"$error":"#N/A"}},{"$f":"IF(SelectedPeriod='Personal Budget'!O$32,IF('Personal Budget'!$F$29:$R$29<0,'Personal Budget'!$F$29:$R$29,NA()),NA())","v":{"$error":"#N/A"}},{"$f":"IF(SelectedPeriod='Personal Budget'!P$32,IF('Personal Budget'!$F$29:$R$29<0,'Personal Budget'!$F$29:$R$29,NA()),NA())","v":{"$error":"#N/A"}},{"$f":"IF(SelectedPeriod='Personal Budget'!Q$32,IF('Personal Budget'!$F$29:$R$29<0,'Personal Budget'!$F$29:$R$29,NA()),NA())","v":{"$error":"#N/A"}},{"$f":"IF(SelectedPeriod='Personal Budget'!R$32,IF('Personal Budget'!$F$29:$R$29<0,'Personal Budget'!$F$29:$R$29,NA()),NA())","v":{"$error":"#N/A"}}]
[]
[]
[null,null,"INCOME CHART DATA"]
[null,null,"Business Drawings",{"$f":"'Personal Budget'!S33","v":0}]
[null,null,"Salary / wages",{"$f":"'Personal Budget'!S34","v":0}]
{"$rows_left_out":11}